Reaction Details
TargetCoagulation factor XI
LigandBDBM50032878
Substrate/Competitorn/a
Meas. Tech.ChEMBL_1443463 (CHEMBL3377177)
Ki 9.0±n/a nM
Citation Hangeland, JJFriends, TJRossi, KASmallheer, JMWang, CSun, ZCorte, JRFang, TWong, PCRendina, ARBarbera, FABozarth, JMLuettgen, JMWatson, CAZhang, GWei, ARamamurthy, VMorin, PEBisacchi, GSSubramaniam, SArunachalam, PMathur, ASeiffert, DAWexler, RRQuan, ML Phenylimidazoles as potent and selective inhibitors of coagulation factor XIa with in vivo antithrombotic activity. J Med Chem57:9915-32 (2014) 
 
Coagulation factor XI
Name:Coagulation factor XI
Type:Enzyme
Mol. Mass.:70130.58
Organism:Homo sapiens (Human)
Description:P03951
Residue:625
BDBM50032878
NameBDBM50032878
Synonyms:CHEMBL3355679
TypeSmall organic molecule
Emp. Form.C28H31BrF3N5O4
Mol. Mass.638.476
SMILESOC(=O)C(F)(F)F.NC[C@H]1CC[C@@H](CC1)C(=O)N[C@@H](Cc1ccccc1)c1nc(c(Br)[nH]1)-c1ccc(cc1)C(N)=O