Reaction Details
TargetCoagulation factor VII
LigandBDBM50032884
Substrate/Competitorn/a
Meas. Tech.ChEMBL_1443464 (CHEMBL3377178)
Ki>10900±n/a nM
Citation Hangeland, JJFriends, TJRossi, KASmallheer, JMWang, CSun, ZCorte, JRFang, TWong, PCRendina, ARBarbera, FABozarth, JMLuettgen, JMWatson, CAZhang, GWei, ARamamurthy, VMorin, PEBisacchi, GSSubramaniam, SArunachalam, PMathur, ASeiffert, DAWexler, RRQuan, ML Phenylimidazoles as potent and selective inhibitors of coagulation factor XIa with in vivo antithrombotic activity. J Med Chem57:9915-32 (2014) 
 
Coagulation factor VII
Name:Coagulation factor VII
Type:Enzyme
Mol. Mass.:51599.89
Organism:Homo sapiens (Human)
Description:n/a
Residue:466
BDBM50032884
NameBDBM50032884
Synonyms:CHEMBL3355673
TypeSmall organic molecule
Emp. Form.C30H36F3N5O4
Mol. Mass.587.6331
SMILESOC(=O)C(F)(F)F.CN(C)C(=O)c1ccc(cc1)-c1c[nH]c(n1)[C@H](Cc1ccccc1)NC(=O)[C@H]1CC[C@H](CN)CC1