Reaction Details
TargetCoagulation factor X
LigandBDBM50032862
Substrate/Competitorn/a
Meas. Tech.ChEMBL_1443465 (CHEMBL3377179)
Ki>8180±n/a nM
Citation Hangeland, JJFriends, TJRossi, KASmallheer, JMWang, CSun, ZCorte, JRFang, TWong, PCRendina, ARBarbera, FABozarth, JMLuettgen, JMWatson, CAZhang, GWei, ARamamurthy, VMorin, PEBisacchi, GSSubramaniam, SArunachalam, PMathur, ASeiffert, DAWexler, RRQuan, ML Phenylimidazoles as potent and selective inhibitors of coagulation factor XIa with in vivo antithrombotic activity. J Med Chem57:9915-32 (2014) 
 
Coagulation factor X
Name:Coagulation factor X
Type:Enzyme
Mol. Mass.:54726.60
Organism:Homo sapiens (Human)
Description:n/a
Residue:488
BDBM50032862
NameBDBM50032862
Synonyms:CHEMBL3355668
TypeSmall organic molecule
Emp. Form.C28H30F3N5O3
Mol. Mass.541.5647
SMILESOC(=O)C(F)(F)F.NC[C@H]1CC[C@@H](CC1)C(=O)N[C@@H](Cc1ccccc1)c1nc(c[nH]1)-c1cccc(c1)C#N