Reaction Details
TargetPlasma kallikrein
LigandBDBM50032885
Substrate/Competitorn/a
Meas. Tech.ChEMBL_1443466 (CHEMBL3377180)
Ki 220±n/a nM
Citation Hangeland, JJFriends, TJRossi, KASmallheer, JMWang, CSun, ZCorte, JRFang, TWong, PCRendina, ARBarbera, FABozarth, JMLuettgen, JMWatson, CAZhang, GWei, ARamamurthy, VMorin, PEBisacchi, GSSubramaniam, SArunachalam, PMathur, ASeiffert, DAWexler, RRQuan, ML Phenylimidazoles as potent and selective inhibitors of coagulation factor XIa with in vivo antithrombotic activity. J Med Chem57:9915-32 (2014) 
 
Plasma kallikrein
Name:Plasma kallikrein
Type:Protein
Mol. Mass.:71391.16
Organism:Homo sapiens (Human)
Description:P03952
Residue:638
BDBM50032885
NameBDBM50032885
Synonyms:CHEMBL3355672
TypeSmall organic molecule
Emp. Form.C29H34F3N5O4
Mol. Mass.573.6066
SMILESOC(=O)C(F)(F)F.CNC(=O)c1ccc(cc1)-c1c[nH]c(n1)[C@H](Cc1ccccc1)NC(=O)[C@H]1CC[C@H](CN)CC1