Reaction Details
TargetHigh affinity cGMP-specific 3',5'-cyclic phosphodiesterase 9A
LigandBDBM50034644
Substrate/Competitorn/a
Meas. Tech.ChEMBL_1440216 (CHEMBL3383761)
IC50 26±n/a nM
Citation Shao, YXHuang, MCui, WFeng, LJWu, YCai, YLi, ZZhu, XLiu, PWan, YKe, HLuo, HB Discovery of a phosphodiesterase 9A inhibitor as a potential hypoglycemic agent. J Med Chem57:10304-13 (2014) 
 
High affinity cGMP-specific 3',5'-cyclic phosphodiesterase 9A
Name:High affinity cGMP-specific 3',5'-cyclic phosphodiesterase 9A
Type:Protein
Mol. Mass.:68488.40
Organism:Homo sapiens (Human)
Description:O76083
Residue:593
BDBM50034644
NameBDBM50034644
Synonyms:CHEMBL3360418 | US9617269, Compound WYQ-88
TypeSmall organic molecule
Emp. Form.C17H20N6O3
Mol. Mass.356.3791
SMILESCOc1ccc(NC(=O)CNc2nc3n(ncc3c(=O)[nH]2)C(C)C)cc1