Reaction Details
TargetHigh affinity cGMP-specific 3',5'-cyclic phosphodiesterase 9A
LigandBDBM50034646
Substrate/Competitorn/a
Meas. Tech.ChEMBL_1440216 (CHEMBL3383761)
IC50 18±n/a nM
Citation Shao, YXHuang, MCui, WFeng, LJWu, YCai, YLi, ZZhu, XLiu, PWan, YKe, HLuo, HB Discovery of a phosphodiesterase 9A inhibitor as a potential hypoglycemic agent. J Med Chem57:10304-13 (2014) 
 
High affinity cGMP-specific 3',5'-cyclic phosphodiesterase 9A
Name:High affinity cGMP-specific 3',5'-cyclic phosphodiesterase 9A
Type:Protein
Mol. Mass.:68488.40
Organism:Homo sapiens (Human)
Description:O76083
Residue:593
BDBM50034646
NameBDBM50034646
Synonyms:CHEMBL3360420
TypeSmall organic molecule
Emp. Form.C19H24N6O3
Mol. Mass.384.4323
SMILESCOc1ccc(NC(=O)[C@@H](C)Nc2nc3n(CC(C)C)ncc3c(=O)[nH]2)cc1