Reaction Details
TargetDual specificity calcium/calmodulin-dependent 3',5'-cyclic nucleotide phosphodiesterase 1B
LigandBDBM50034647
Substrate/Competitorn/a
Meas. Tech.ChEMBL_1440217 (CHEMBL3383762)
IC50 1900±n/a nM
Citation Shao, YXHuang, MCui, WFeng, LJWu, YCai, YLi, ZZhu, XLiu, PWan, YKe, HLuo, HB Discovery of a phosphodiesterase 9A inhibitor as a potential hypoglycemic agent. J Med Chem57:10304-13 (2014) 
 
Dual specificity calcium/calmodulin-dependent 3',5'-cyclic nucleotide phosphodiesterase 1B
Name:Dual specificity calcium/calmodulin-dependent 3',5'-cyclic nucleotide phosphodiesterase 1B
Type:Enzyme
Mol. Mass.:61366.51
Organism:Homo sapiens (Human)
Description:n/a
Residue:536
BDBM50034647
NameBDBM50034647
Synonyms:CHEMBL3360412
TypeSmall organic molecule
Emp. Form.C21H19ClN6O3
Mol. Mass.438.867
SMILESCOc1ccc(NC(=O)[C@@H](C)Nc2nc3n(ncc3c(=O)[nH]2)-c2ccccc2Cl)cc1