Reaction Details
TargetDual specificity calcium/calmodulin-dependent 3',5'-cyclic nucleotide phosphodiesterase 1B
LigandBDBM50034642
Substrate/Competitorn/a
Meas. Tech.ChEMBL_1440217 (CHEMBL3383762)
IC50 2300±n/a nM
Citation Shao, YXHuang, MCui, WFeng, LJWu, YCai, YLi, ZZhu, XLiu, PWan, YKe, HLuo, HB Discovery of a phosphodiesterase 9A inhibitor as a potential hypoglycemic agent. J Med Chem57:10304-13 (2014) 
 
Dual specificity calcium/calmodulin-dependent 3',5'-cyclic nucleotide phosphodiesterase 1B
Name:Dual specificity calcium/calmodulin-dependent 3',5'-cyclic nucleotide phosphodiesterase 1B
Type:Enzyme
Mol. Mass.:61366.51
Organism:Homo sapiens (Human)
Description:n/a
Residue:536
BDBM50034642
NameBDBM50034642
Synonyms:CHEMBL3360416
TypeSmall organic molecule
Emp. Form.C20H24N6O3
Mol. Mass.396.443
SMILESCOc1ccc(NC(=O)[C@H](C)Nc2nc3n(ncc3c(=O)[nH]2)C2CCCC2)cc1