Reaction Details
TargetcGMP-specific 3',5'-cyclic phosphodiesterase
LigandBDBM50034649
Substrate/Competitorn/a
Meas. Tech.ChEMBL_1440219 (CHEMBL3383764)
IC50 3300±n/a nM
Citation Shao, YXHuang, MCui, WFeng, LJWu, YCai, YLi, ZZhu, XLiu, PWan, YKe, HLuo, HB Discovery of a phosphodiesterase 9A inhibitor as a potential hypoglycemic agent. J Med Chem57:10304-13 (2014) 
 
cGMP-specific 3',5'-cyclic phosphodiesterase
Name:cGMP-specific 3',5'-cyclic phosphodiesterase
Type:Protein
Mol. Mass.:99975.83
Organism:Homo sapiens (Human)
Description:O76074
Residue:875
BDBM50034649
NameBDBM50034649
Synonyms:CHEMBL3360413
TypeSmall organic molecule
Emp. Form.C21H19ClN6O3
Mol. Mass.438.867
SMILESCOc1ccc(NC(=O)[C@H](C)Nc2nc3n(ncc3c(=O)[nH]2)-c2ccccc2Cl)cc1