Reaction Details
TargetcAMP and cAMP-inhibited cGMP 3',5'-cyclic phosphodiesterase 10A
LigandBDBM50034647
Substrate/Competitorn/a
Meas. Tech.ChEMBL_1440222 (CHEMBL3383767)
IC50 3700±n/a nM
Citation Shao, YXHuang, MCui, WFeng, LJWu, YCai, YLi, ZZhu, XLiu, PWan, YKe, HLuo, HB Discovery of a phosphodiesterase 9A inhibitor as a potential hypoglycemic agent. J Med Chem57:10304-13 (2014) 
 
cAMP and cAMP-inhibited cGMP 3',5'-cyclic phosphodiesterase 10A
Name:cAMP and cAMP-inhibited cGMP 3',5'-cyclic phosphodiesterase 10A
Type:Protein
Mol. Mass.:88412.52
Organism:Homo sapiens (Human)
Description:Q9Y233
Residue:1055
BDBM50034647
NameBDBM50034647
Synonyms:CHEMBL3360412
TypeSmall organic molecule
Emp. Form.C21H19ClN6O3
Mol. Mass.438.867
SMILESCOc1ccc(NC(=O)[C@@H](C)Nc2nc3n(ncc3c(=O)[nH]2)-c2ccccc2Cl)cc1