Reaction Details
TargetcGMP-inhibited 3',5'-cyclic phosphodiesterase 3A
LigandBDBM50034649
Substrate/Competitorn/a
Meas. Tech.ChEMBL_1440224 (CHEMBL3383769)
IC50>50000±n/a nM
Citation Shao, YXHuang, MCui, WFeng, LJWu, YCai, YLi, ZZhu, XLiu, PWan, YKe, HLuo, HB Discovery of a phosphodiesterase 9A inhibitor as a potential hypoglycemic agent. J Med Chem57:10304-13 (2014) 
 
cGMP-inhibited 3',5'-cyclic phosphodiesterase 3A
Name:cGMP-inhibited 3',5'-cyclic phosphodiesterase 3A
Type:Enzyme
Mol. Mass.:124966.46
Organism:Homo sapiens (Human)
Description:Q14432
Residue:1141
BDBM50034649
NameBDBM50034649
Synonyms:CHEMBL3360413
TypeSmall organic molecule
Emp. Form.C21H19ClN6O3
Mol. Mass.438.867
SMILESCOc1ccc(NC(=O)[C@H](C)Nc2nc3n(ncc3c(=O)[nH]2)-c2ccccc2Cl)cc1