Reaction Details
TargetOxysterols receptor LXR-beta
LigandBDBM19993
Substrate/Competitorn/a
Meas. Tech.ChEMBL_1441019 (CHEMBL3377015)
EC50 140±n/a nM
Citation Kick, EMartin, RXie, YFlatt, BSchweiger, EWang, TLBusch, BNyman, MGu, XHYan, GWagner, BNanao, MNguyen, LStout, TPlonowski, ASchulman, IOstrowski, JKirchgessner, TWexler, RMohan, R Liver X receptor (LXR) partial agonists: biaryl pyrazoles and imidazoles displaying a preference for LXRß. Bioorg Med Chem Lett25:372-7 (2014) 
 
Oxysterols receptor LXR-beta
Name:Oxysterols receptor LXR-beta
Type:Enzyme Catalytic Domain
Mol. Mass.:50978.79
Organism:Homo sapiens (Human)
Description:P55055
Residue:460
BDBM19993
NameBDBM19993
Synonyms:CHEMBL62136 T 0901317 TO-901317 US10669296, Compound TO901317 [3H]T0901317
TypeSmall organic molecule
Emp. Form.C17H12F9NO3S
Mol. Mass.481.333
SMILESOC(c1ccc(cc1)N(CC(F)(F)F)S(=O)(=O)c1ccccc1)(C(F)(F)F)C(F)(F)F