Reaction Details
TargetCannabinoid receptor 1
LigandBDBM50040984
Substrate/Competitorn/a
Meas. Tech.ChEMBL_1444764 (CHEMBL3378465)
EC50 217±n/a nM
Citation Han, SThoresen, LZhu, XNarayanan, SJung, JKStrah-Pleynet, SDecaire, MChoi, KXiong, YYue, DSemple, GThatte, JSolomon, MFu, LWhelan, KAl-Shamma, HGatlin, JChen, RDang, HPride, CGaidarov, IUnett, DJBehan, DPSadeque, AUsmani, KAChen, CEdwards, JMorgan, MJones, RM Discovery of 1a,2,5,5a-tetrahydro-1H-2,3-diaza-cyclopropa[a]pentalen-4-carboxamides as potent and selective CB2 receptor agonists. Bioorg Med Chem Lett25:322-6 (2014) 
 
Cannabinoid receptor 1
Name:Cannabinoid receptor 1
Type:G Protein-Coupled Receptor (GPCR)
Mol. Mass.:52868.96
Organism:Homo sapiens (Human)
Description:P21554
Residue:472
BDBM50040984
NameBDBM50040984
Synonyms:CHEMBL3354961
TypeSmall organic molecule
Emp. Form.C24H27F2N3O
Mol. Mass.411.4875
SMILES[H][C@]12C[C@@]1([H])c1c(C2)c(nn1-c1ccc(F)cc1F)C(=O)N[C@@H]1[C@]2(C)CC[C@@]([H])(C2)C1(C)C