Reaction Details
TargetCannabinoid receptor 1
LigandBDBM50040999
Substrate/Competitorn/a
Meas. Tech.ChEMBL_1444764 (CHEMBL3378465)
EC50 381±n/a nM
Citation Han, SThoresen, LZhu, XNarayanan, SJung, JKStrah-Pleynet, SDecaire, MChoi, KXiong, YYue, DSemple, GThatte, JSolomon, MFu, LWhelan, KAl-Shamma, HGatlin, JChen, RDang, HPride, CGaidarov, IUnett, DJBehan, DPSadeque, AUsmani, KAChen, CEdwards, JMorgan, MJones, RM Discovery of 1a,2,5,5a-tetrahydro-1H-2,3-diaza-cyclopropa[a]pentalen-4-carboxamides as potent and selective CB2 receptor agonists. Bioorg Med Chem Lett25:322-6 (2014) 
 
Cannabinoid receptor 1
Name:Cannabinoid receptor 1
Type:G Protein-Coupled Receptor (GPCR)
Mol. Mass.:52868.96
Organism:Homo sapiens (Human)
Description:P21554
Residue:472
BDBM50040999
NameBDBM50040999
Synonyms:CHEMBL3354944
TypeSmall organic molecule
Emp. Form.C22H22N4O
Mol. Mass.358.4363
SMILES[H][C@]12C[C@@]1([H])c1c(C2)c(nn1-c1ccccn1)C(=O)NC(C)(C)c1ccccc1