Reaction Details
TargetCannabinoid receptor 1
LigandBDBM50040961
Substrate/Competitorn/a
Meas. Tech.ChEMBL_1444771 (CHEMBL3378472)
EC50>30000±n/a nM
Citation Han, SThoresen, LZhu, XNarayanan, SJung, JKStrah-Pleynet, SDecaire, MChoi, KXiong, YYue, DSemple, GThatte, JSolomon, MFu, LWhelan, KAl-Shamma, HGatlin, JChen, RDang, HPride, CGaidarov, IUnett, DJBehan, DPSadeque, AUsmani, KAChen, CEdwards, JMorgan, MJones, RM Discovery of 1a,2,5,5a-tetrahydro-1H-2,3-diaza-cyclopropa[a]pentalen-4-carboxamides as potent and selective CB2 receptor agonists. Bioorg Med Chem Lett25:322-6 (2014) 
 
Cannabinoid receptor 1
Name:Cannabinoid receptor 1
Type:G Protein-Coupled Receptor (GPCR)
Mol. Mass.:52856.55
Organism:Rattus norvegicus (rat)
Description:P20272
Residue:473
BDBM50040961
NameBDBM50040961
Synonyms:CHEMBL3354952
TypeSmall organic molecule
Emp. Form.C18H19F2N3O2
Mol. Mass.347.3592
SMILES[H][C@]12C[C@@]1([H])c1c(C2)c(nn1-c1ccc(F)cc1F)C(=O)NC(C)(C)CO