Reaction Details
TargetSerine/threonine-protein kinase ATR
LigandBDBM50043384
Substrate/Competitorn/a
Meas. Tech.ChEMBL_1444858 (CHEMBL3379628)
IC50 0.500000±n/a nM
Citation Barsanti, PAAversa, RJJin, XPan, YLu, YElling, RJain, RKnapp, MLan, JLin, XRudewicz, PSim, JTaricani, LThomas, GXiao, LYue, Q Structure-Based Drug Design of Novel Potent and Selective Tetrahydropyrazolo[1,5-a]pyrazines as ATR Inhibitors. ACS Med Chem Lett6:37-41 (2015) 
 
Serine/threonine-protein kinase ATR
Name:Serine/threonine-protein kinase ATR
Type:Protein
Mol. Mass.:301404.58
Organism:Homo sapiens (Human)
Description:Q13535
Residue:2644
BDBM50043384
NameBDBM50043384
Synonyms:CHEMBL3355071
TypeSmall organic molecule
Emp. Form.C22H24N6O2S
Mol. Mass.436.53
SMILESC[C@@H]1Cn2ncc(c2CN1c1ccnc2[nH]ccc12)-c1ccc(cc1)S(=O)(=O)N(C)C