Reaction Details
TargetPhosphatidylinositol 4,5-bisphosphate 3-kinase catalytic subunit alpha isoform
LigandBDBM50043381
Substrate/Competitorn/a
Meas. Tech.ChEMBL_1444868 (CHEMBL3379638)
IC50 9.0±n/a nM
Citation Barsanti, PAAversa, RJJin, XPan, YLu, YElling, RJain, RKnapp, MLan, JLin, XRudewicz, PSim, JTaricani, LThomas, GXiao, LYue, Q Structure-Based Drug Design of Novel Potent and Selective Tetrahydropyrazolo[1,5-a]pyrazines as ATR Inhibitors. ACS Med Chem Lett6:37-41 (2015) 
 
Phosphatidylinositol 4,5-bisphosphate 3-kinase catalytic subunit alpha isoform
Name:Phosphatidylinositol 4,5-bisphosphate 3-kinase catalytic subunit alpha isoform
Type:Enzyme Subunit
Mol. Mass.:124294.87
Organism:Homo sapiens (Human)
Description:P42336
Residue:1068
BDBM50043381
NameBDBM50043381
Synonyms:CHEMBL3355068
TypeSmall organic molecule
Emp. Form.C21H18N4O3
Mol. Mass.374.3926
SMILESCOc1ccc(cc1OC)-c1ccc2ncc(-c3ccc(cc3)C(N)=O)n2n1