Reaction Details
TargetPotassium voltage-gated channel subfamily H member 2
LigandBDBM50054540
Substrate/Competitorn/a
Meas. Tech.ChEMBL_1452204 (CHEMBL3365826)
IC50 5500±n/a nM
Citation Ehara, TIrie, OKosaka, TKanazawa, TBreitenstein, WGrosche, POstermann, NSuzuki, MKawakami, SKonishi, KHitomi, YToyao, AGunji, HCumin, FSchiering, NWagner, TRigel, DFWebb, RLMaibaum, JYokokawa, F Structure-based design of substituted piperidines as a new class of highly efficacious oral direct Renin inhibitors. ACS Med Chem Lett5:787-92 (2014) 
 
Potassium voltage-gated channel subfamily H member 2
Name:Potassium voltage-gated channel subfamily H member 2
Type:Multi-pass membrane protein
Mol. Mass.:126672.65
Organism:Homo sapiens (Human)
Description:Q12809
Residue:1159
BDBM50054540
NameBDBM50054540
Synonyms:CHEMBL3318939
TypeSmall organic molecule
Emp. Form.C31H51ClFN3O5
Mol. Mass.600.205
SMILESCl.CCOC[C@@H](CC(C)C)NC(=O)[C@@H]1CNC[C@@H](C1)C(=O)N(C1CC1)c1cc(OCCCOC)c(cc1F)C(C)C