Reaction Details
TargetRenin
LigandBDBM50054635
Substrate/Competitorn/a
Meas. Tech.ChEMBL_1452194 (CHEMBL3365816)
IC50 3.0±n/a nM
Citation Ehara, TIrie, OKosaka, TKanazawa, TBreitenstein, WGrosche, POstermann, NSuzuki, MKawakami, SKonishi, KHitomi, YToyao, AGunji, HCumin, FSchiering, NWagner, TRigel, DFWebb, RLMaibaum, JYokokawa, F Structure-based design of substituted piperidines as a new class of highly efficacious oral direct Renin inhibitors. ACS Med Chem Lett5:787-92 (2014) 
 
Renin
Name:Renin
Type:Enzyme
Mol. Mass.:45058.99
Organism:Homo sapiens (Human)
Description:n/a
Residue:406
BDBM50054635
NameBDBM50054635
Synonyms:CHEMBL3318936
TypeSmall organic molecule
Emp. Form.C29H44N4O4
Mol. Mass.512.6841
SMILESCOCCCn1cc(CN(C2CC2)C(=O)[C@H]2CNC[C@H](C2)C(=O)N[C@@H](CO)CC(C)C)c2ccccc12