Reaction Details
TargetRenin
LigandBDBM50054634
Substrate/Competitorn/a
Meas. Tech.ChEMBL_1452195 (CHEMBL3365817)
IC50 6.0±n/a nM
Citation Ehara, TIrie, OKosaka, TKanazawa, TBreitenstein, WGrosche, POstermann, NSuzuki, MKawakami, SKonishi, KHitomi, YToyao, AGunji, HCumin, FSchiering, NWagner, TRigel, DFWebb, RLMaibaum, JYokokawa, F Structure-based design of substituted piperidines as a new class of highly efficacious oral direct Renin inhibitors. ACS Med Chem Lett5:787-92 (2014) 
 
Renin
Name:Renin
Type:Enzyme
Mol. Mass.:45058.99
Organism:Homo sapiens (Human)
Description:n/a
Residue:406
BDBM50054634
NameBDBM50054634
Synonyms:CHEMBL3318942
TypeSmall organic molecule
Emp. Form.C30H51ClN4O5
Mol. Mass.583.203
SMILESCl.CCOC[C@@H](CC(C)C)NC(=O)[C@@H]1CNC[C@@H](C1)C(=O)N(C1CC1)c1ccc(C(C)C)c(OCCCOC)n1