Reaction Details
TargetRenin
LigandBDBM50054643
Substrate/Competitorn/a
Meas. Tech.ChEMBL_1452194 (CHEMBL3365816)
IC50 300±n/a nM
Citation Ehara, TIrie, OKosaka, TKanazawa, TBreitenstein, WGrosche, POstermann, NSuzuki, MKawakami, SKonishi, KHitomi, YToyao, AGunji, HCumin, FSchiering, NWagner, TRigel, DFWebb, RLMaibaum, JYokokawa, F Structure-based design of substituted piperidines as a new class of highly efficacious oral direct Renin inhibitors. ACS Med Chem Lett5:787-92 (2014) 
 
Renin
Name:Renin
Type:Enzyme
Mol. Mass.:45058.99
Organism:Homo sapiens (Human)
Description:n/a
Residue:406
BDBM50054643
NameBDBM50054643
Synonyms:CHEMBL3318933
TypeSmall organic molecule
Emp. Form.C27H40N4O3
Mol. Mass.468.6315
SMILESCOCCCn1cc(CN(C2CC2)C(=O)[C@H]2CNC[C@H](C2)NC(=O)CC(C)C)c2ccccc12