Reaction Details
TargetP2Y purinoceptor 12
LigandBDBM50055843
Substrate/Competitorn/a
Meas. Tech.ChEMBL_1454018 (CHEMBL3367077)
IC50 15±n/a nM
Citation Boldron, CBesse, ABordes, MFTissandié, SYvon, XGau, BBadorc, ARousseaux, TBarré, GMeneyrol, JZech, GNazare, MFossey, VPflieger, AMBonnet-Lignon, SMillet, LBriot, CDol, FHérault, JPSavi, PLassalle, GDelesque, NHerbert, JMBono, F N-[6-(4-butanoyl-5-methyl-1H-pyrazol-1-yl)pyridazin-3-yl]-5-chloro-1-[2-(4-methylpiperazin-1-yl)-2-oxoethyl]-1H-indole-3-carboxamide (SAR216471), a novel intravenous and oral, reversible, and directly acting P2Y12 antagonist. J Med Chem57:7293-316 (2014) 
 
P2Y purinoceptor 12
Name:P2Y purinoceptor 12
Type:Enzyme
Mol. Mass.:39458.48
Organism:Homo sapiens (Human)
Description:Q9H244
Residue:342
BDBM50055843
NameBDBM50055843
Synonyms:CHEMBL3325785
TypeSmall organic molecule
Emp. Form.C34H40N6O4
Mol. Mass.596.7192
SMILES[H][C@@]12C[C@@H](O)CN1C[C@H](C)N(C2)C(=O)Cn1cc(C(=O)Nc2ccc(cc2)-n2ncc(C(=O)CCC)c2C)c2cc(C)ccc12