Reaction Details
TargetP2Y purinoceptor 12
LigandBDBM50100247
Substrate/Competitorn/a
Meas. Tech.ChEMBL_1454018 (CHEMBL3367077)
IC50 17±n/a nM
Citation Boldron, CBesse, ABordes, MFTissandié, SYvon, XGau, BBadorc, ARousseaux, TBarré, GMeneyrol, JZech, GNazare, MFossey, VPflieger, AMBonnet-Lignon, SMillet, LBriot, CDol, FHérault, JPSavi, PLassalle, GDelesque, NHerbert, JMBono, F N-[6-(4-butanoyl-5-methyl-1H-pyrazol-1-yl)pyridazin-3-yl]-5-chloro-1-[2-(4-methylpiperazin-1-yl)-2-oxoethyl]-1H-indole-3-carboxamide (SAR216471), a novel intravenous and oral, reversible, and directly acting P2Y12 antagonist. J Med Chem57:7293-316 (2014) 
 
P2Y purinoceptor 12
Name:P2Y purinoceptor 12
Type:Enzyme
Mol. Mass.:39458.48
Organism:Homo sapiens (Human)
Description:Q9H244
Residue:342
BDBM50100247
NameBDBM50100247
Synonyms:CHEMBL3325891
TypeSmall organic molecule
Emp. Form.C28H31ClN8O3
Mol. Mass.563.051
SMILESCCCC(=O)c1cnn(c1C)-c1ccc(NC(=O)c2cn(CC(=O)N3CCN(C)CC3)c3ccc(Cl)cc23)nn1