Reaction Details
TargetDelta-type opioid receptor
LigandBDBM50055965
Substrate/Competitorn/a
Meas. Tech.ChEMBL_1460277 (CHEMBL3370193)
IC50>100000±n/a nM
Citation Cheng, MFOu, LCChen, SCChang, WTLaw, PYLoh, HHChao, YSShih, CYeh, SHUeng, SH Discovery, structure-activity relationship studies, and anti-nociceptive effects of 1-phenyl-3,6,6-trimethyl-1,5,6,7-tetrahydro-4H-indazol-4-one as novel opioid receptor agonists. Bioorg Med Chem22:4694-703 (2014) 
 
Delta-type opioid receptor
Name:Delta-type opioid receptor
Type:G Protein-Coupled Receptor (GPCR)
Mol. Mass.:40382.98
Organism:Homo sapiens (Human)
Description:Competition binding assays were carried out using membrane preparations from transfected HN9.10 cells that constitutively expressed the delta opioid receptor.
Residue:372
BDBM50055965
NameBDBM50055965
Synonyms:CHEMBL3325716
TypeSmall organic molecule
Emp. Form.C17H19BrN2O
Mol. Mass.347.25
SMILESCc1nn(c2CC(C)(C)CC(=O)c12)-c1ccc(C)cc1Br