Reaction Details
TargetNociceptin receptor
LigandBDBM50060843
Substrate/Competitorn/a
Meas. Tech.ChEMBL_1462194 (CHEMBL3395051)
IC50 8.0±n/a nM
Citation Ross, TMBattista, KBignan, GCBrenneman, DEConnolly, PJLiu, JMiddleton, SAOrsini, MReitz, ABRosenthal, DIScott, MKVaidya, AH A selective small molecule NOP (ORL-1 receptor) partial agonist for the treatment of anxiety. Bioorg Med Chem Lett25:602-6 (2015) 
 
Nociceptin receptor
Name:Nociceptin receptor
Type:G Protein-Coupled Receptor (GPCR)
Mol. Mass.:40702.87
Organism:Homo sapiens (Human)
Description:P41146
Residue:370
BDBM50060843
NameBDBM50060843
Synonyms:CHEMBL3394748
TypeSmall organic molecule
Emp. Form.C33H38N4O2S2
Mol. Mass.586.81
SMILESO[C@H](CNCc1cccs1)CN1CN(c2ccccc2)C2(CCN(CCc3ccccc3-c3cccs3)CC2)C1=O