Reaction Details
TargetNociceptin receptor
LigandBDBM50060848
Substrate/Competitorn/a
Meas. Tech.ChEMBL_1462194 (CHEMBL3395051)
IC50 3.9±n/a nM
Citation Ross, TMBattista, KBignan, GCBrenneman, DEConnolly, PJLiu, JMiddleton, SAOrsini, MReitz, ABRosenthal, DIScott, MKVaidya, AH A selective small molecule NOP (ORL-1 receptor) partial agonist for the treatment of anxiety. Bioorg Med Chem Lett25:602-6 (2015) 
 
Nociceptin receptor
Name:Nociceptin receptor
Type:G Protein-Coupled Receptor (GPCR)
Mol. Mass.:40702.87
Organism:Homo sapiens (Human)
Description:P41146
Residue:370
BDBM50060848
NameBDBM50060848
Synonyms:CHEMBL3394751
TypeSmall organic molecule
Emp. Form.C38H46N4O4S
Mol. Mass.654.861
SMILESCOc1ccc(CCNC[C@@H](O)CN2CN(c3ccccc3)C3(CCN(CCc4ccccc4-c4cccs4)CC3)C2=O)cc1OC