Reaction Details
TargetMu-type opioid receptor
LigandBDBM50060837
Substrate/Competitorn/a
Meas. Tech.ChEMBL_1462195 (CHEMBL3395052)
IC50 110±n/a nM
Citation Ross, TMBattista, KBignan, GCBrenneman, DEConnolly, PJLiu, JMiddleton, SAOrsini, MReitz, ABRosenthal, DIScott, MKVaidya, AH A selective small molecule NOP (ORL-1 receptor) partial agonist for the treatment of anxiety. Bioorg Med Chem Lett25:602-6 (2015) 
 
Mu-type opioid receptor
Name:Mu-type opioid receptor
Type:G Protein-Coupled Receptor (GPCR)
Mol. Mass.:44789.51
Organism:Homo sapiens (Human)
Description:P35372
Residue:400
BDBM50060837
NameBDBM50060837
Synonyms:CHEMBL3394744
TypeSmall organic molecule
Emp. Form.C36H42N4O3S
Mol. Mass.610.809
SMILESCOc1ccc(CNC[C@@H](O)CN2CN(c3ccccc3)C3(CCN(CCc4ccccc4-c4cccs4)CC3)C2=O)cc1