Reaction Details
TargetMu-type opioid receptor
LigandBDBM50060838
Substrate/Competitorn/a
Meas. Tech.ChEMBL_1462195 (CHEMBL3395052)
IC50 36±n/a nM
Citation Ross, TMBattista, KBignan, GCBrenneman, DEConnolly, PJLiu, JMiddleton, SAOrsini, MReitz, ABRosenthal, DIScott, MKVaidya, AH A selective small molecule NOP (ORL-1 receptor) partial agonist for the treatment of anxiety. Bioorg Med Chem Lett25:602-6 (2015) 
 
Mu-type opioid receptor
Name:Mu-type opioid receptor
Type:G Protein-Coupled Receptor (GPCR)
Mol. Mass.:44789.51
Organism:Homo sapiens (Human)
Description:P35372
Residue:400
BDBM50060838
NameBDBM50060838
Synonyms:CHEMBL3394745
TypeSmall organic molecule
Emp. Form.C39H48N4O2S
Mol. Mass.636.889
SMILESCCCCN(C[C@H](O)CN1CN(c2ccccc2)C2(CCN(CCc3ccccc3-c3cccs3)CC2)C1=O)Cc1ccccc1