Reaction Details
TargetMu-type opioid receptor
LigandBDBM50060903
Substrate/Competitorn/a
Meas. Tech.ChEMBL_1462195 (CHEMBL3395052)
IC50 820±n/a nM
Citation Ross, TMBattista, KBignan, GCBrenneman, DEConnolly, PJLiu, JMiddleton, SAOrsini, MReitz, ABRosenthal, DIScott, MKVaidya, AH A selective small molecule NOP (ORL-1 receptor) partial agonist for the treatment of anxiety. Bioorg Med Chem Lett25:602-6 (2015) 
 
Mu-type opioid receptor
Name:Mu-type opioid receptor
Type:G Protein-Coupled Receptor (GPCR)
Mol. Mass.:44789.51
Organism:Homo sapiens (Human)
Description:P35372
Residue:400
BDBM50060903
NameBDBM50060903
Synonyms:CHEMBL3394756
TypeSmall organic molecule
Emp. Form.C38H56FN5O3
Mol. Mass.649.8813
SMILESCC(C)[C@@H](N)C(=O)N(C[C@H](O)CN1CN(c2ccc(F)cc2)C2(CCN(CC3CCCCCCC3)CC2)C1=O)Cc1ccc(C)cc1