Reaction Details
TargetKappa-type opioid receptor
LigandBDBM50366356
Substrate/Competitorn/a
Meas. Tech.ChEMBL_1461561 (CHEMBL3396802)
EC50 0.500000±n/a nM
Citation Sasmal, PKKrishna, CVAdabala, SSRoshaiah, MRawoof, KAThadi, ESukumar, KPCheera, SAbbineni, CRao, KVPrasanthi, ANijhawan, KJaleel, MIyer, LRChaitanya, TKTiwari, NKKrishna, NLPotluri, VKhanna, IFrimurer, TMLückmann, MRist, ØElster, LHögberg, T Optimisation of in silico derived 2-aminobenzimidazole hits as unprecedented selective kappa opioid receptor agonists. Bioorg Med Chem Lett25:887-92 (2015) 
 
Kappa-type opioid receptor
Name:Kappa-type opioid receptor
Type:G Protein-Coupled Receptor (GPCR)
Mol. Mass.:42648.76
Organism:Homo sapiens (Human)
Description:P41145
Residue:380
BDBM50366356
NameBDBM50366356
Synonyms:ASIMADOLINE HYDROCHLORIDE | EMD-61753
TypeSmall organic molecule
Emp. Form.C27H30N2O2
Mol. Mass.414.5393
SMILESCN([C@H](CN1CC[C@H](O)C1)c1ccccc1)C(=O)C(c1ccccc1)c1ccccc1