Reaction Details
TargetSphingosine 1-phosphate receptor 1
LigandBDBM50063872
Substrate/Competitorn/a
Meas. Tech.ChEMBL_1463789 (CHEMBL3404799)
EC50 220±n/a nM
Citation Buzard, DJSchrader, TOZhu, XLehmann, JJohnson, BKasem, MKim, SHKawasaki, ALopez, LMoody, JHan, SGao, YEdwards, JBarden, JThatte, JGatlin, JJones, RM Design and synthesis of new tricyclic indoles as potent modulators of the S1P1 receptor. Bioorg Med Chem Lett25:659-63 (2015) 
 
Sphingosine 1-phosphate receptor 1
Name:Sphingosine 1-phosphate receptor 1
Type:Enzyme
Mol. Mass.:42836.02
Organism:Homo sapiens (Human)
Description:P21453
Residue:382
BDBM50063872
NameBDBM50063872
Synonyms:CHEMBL3400913
TypeSmall organic molecule
Emp. Form.C22H18F3N3O4
Mol. Mass.445.3912
SMILESOC(=O)CC1NCCc2c1[nH]c1ccc(OCc3cc(OC(F)(F)F)cc(c3)C#N)cc21