Reaction Details
TargetSphingosine 1-phosphate receptor 1
LigandBDBM50063880
Substrate/Competitorn/a
Meas. Tech.ChEMBL_1463789 (CHEMBL3404799)
EC50 2.3±n/a nM
Citation Buzard, DJSchrader, TOZhu, XLehmann, JJohnson, BKasem, MKim, SHKawasaki, ALopez, LMoody, JHan, SGao, YEdwards, JBarden, JThatte, JGatlin, JJones, RM Design and synthesis of new tricyclic indoles as potent modulators of the S1P1 receptor. Bioorg Med Chem Lett25:659-63 (2015) 
 
Sphingosine 1-phosphate receptor 1
Name:Sphingosine 1-phosphate receptor 1
Type:Enzyme
Mol. Mass.:42836.02
Organism:Homo sapiens (Human)
Description:P21453
Residue:382
BDBM50063880
NameBDBM50063880
Synonyms:CHEMBL3400906
TypeSmall organic molecule
Emp. Form.C27H28F3NO3
Mol. Mass.471.5113
SMILESOC(=O)CC1CCCn2c1cc1cc(OCc3ccc(C4CCCC4)c(c3)C(F)(F)F)ccc21