Reaction Details
TargetSphingosine 1-phosphate receptor 1
LigandBDBM50063890
Substrate/Competitorn/a
Meas. Tech.ChEMBL_1463789 (CHEMBL3404799)
EC50 0.140000±n/a nM
Citation Buzard, DJSchrader, TOZhu, XLehmann, JJohnson, BKasem, MKim, SHKawasaki, ALopez, LMoody, JHan, SGao, YEdwards, JBarden, JThatte, JGatlin, JJones, RM Design and synthesis of new tricyclic indoles as potent modulators of the S1P1 receptor. Bioorg Med Chem Lett25:659-63 (2015) 
 
Sphingosine 1-phosphate receptor 1
Name:Sphingosine 1-phosphate receptor 1
Type:Enzyme
Mol. Mass.:42836.02
Organism:Homo sapiens (Human)
Description:P21453
Residue:382
BDBM50063890
NameBDBM50063890
Synonyms:CHEMBL3403626
TypeSmall organic molecule
Emp. Form.C26H26F3NO4
Mol. Mass.473.4841
SMILESOC(=O)CC1OCCn2c1cc1cc(OCc3ccc(C4CCCC4)c(c3)C(F)(F)F)ccc21