Reaction Details
TargetSphingosine 1-phosphate receptor 1
LigandBDBM50063864
Substrate/Competitorn/a
Meas. Tech.ChEMBL_1463795 (CHEMBL3404805)
EC50 0.040000±n/a nM
Citation Buzard, DJSchrader, TOZhu, XLehmann, JJohnson, BKasem, MKim, SHKawasaki, ALopez, LMoody, JHan, SGao, YEdwards, JBarden, JThatte, JGatlin, JJones, RM Design and synthesis of new tricyclic indoles as potent modulators of the S1P1 receptor. Bioorg Med Chem Lett25:659-63 (2015) 
 
Sphingosine 1-phosphate receptor 1
Name:Sphingosine 1-phosphate receptor 1
Type:PROTEIN
Mol. Mass.:42410.96
Organism:Canis lupus familiaris
Description:ChEMBL_109735
Residue:381
BDBM50063864
NameBDBM50063864
Synonyms:CHEMBL3403619 | US10676467, Compound TZ 50 13
TypeSmall organic molecule
Emp. Form.C26H27F3N2O3
Mol. Mass.472.4994
SMILESOC(=O)CC1NCCc2c1[nH]c1ccc(OCc3ccc(C4CCCC4)c(c3)C(F)(F)F)cc21