Reaction Details
TargetTyrosine-protein kinase BTK
LigandBDBM50064871
Substrate/Competitorn/a
Meas. Tech.ChEMBL_1465191 (CHEMBL3406075)
IC50 3700±n/a nM
Citation Young, WBBarbosa, JBlomgren, PBremer, MCCrawford, JJDambach, DGallion, SHymowitz, SGKropf, JELee, SHLiu, LLubach, JWMacaluso, JMaciejewski, PMaurer, BMitchell, SAOrtwine, DFDi Paolo, JReif, KScheerens, HSchmitt, ASowell, CGWang, XWong, HXiong, JMXu, JZhao, ZCurrie, KS Potent and selective Bruton's tyrosine kinase inhibitors: discovery of GDC-0834. Bioorg Med Chem Lett25:1333-7 (2015) 
 
Tyrosine-protein kinase BTK
Name:Tyrosine-protein kinase BTK
Type:PROTEIN
Mol. Mass.:76447.19
Organism:Mus musculus
Description:ChEMBL_108319
Residue:659
BDBM50064871
NameBDBM50064871
Synonyms:CHEMBL3401273
TypeSmall organic molecule
Emp. Form.C32H35N7O4
Mol. Mass.581.6648
SMILESCc1c(NC(=O)c2cnc(nc2)C(C)(C)C)cccc1-c1cn(C)c(=O)c(Nc2ccc(cc2)C(=O)N2CCOCC2)n1