Reaction Details
TargetMuscarinic acetylcholine receptor M2
LigandBDBM50021892
Substrate/Competitorn/a
Meas. Tech.ChEMBL_1465997 (CHEMBL3406979)
IC50 2.0±n/a nM
Citation Prat, MBuil, MAFernández, MDTort, LMonleón, JMCasals, GFerrer, MCastro, JGavaldà, AMiralpeix, MRamos, IVilella, DHuerta, JMEspinosa, SHernández, BSegarra, VCórdoba, M Discovery of novel quaternary ammonium derivatives of (3R)-quinuclidinyl amides as potent and long acting muscarinic antagonists. Bioorg Med Chem Lett25:1736-41 (2015) 
 
Muscarinic acetylcholine receptor M2
Name:Muscarinic acetylcholine receptor M2
Type:GPCR
Mol. Mass.:51730.61
Organism:Homo sapiens (Human)
Description:P08172
Residue:466
BDBM50021892
NameBDBM50021892
Synonyms:Ipratropium Bromide
TypeSmall organic molecule
Emp. Form.C20H30BrNO3
Mol. Mass.412.361
SMILES[Br-].[H][C@]12CC[C@]([H])(C[C@@H](C1)OC(=O)C(CO)c1ccccc1)[N+]2(C)C(C)C