Reaction Details
TargetMuscarinic acetylcholine receptor M2
LigandBDBM50066858
Substrate/Competitorn/a
Meas. Tech.ChEMBL_1465997 (CHEMBL3406979)
IC50 0.900000±n/a nM
Citation Prat, MBuil, MAFernández, MDTort, LMonleón, JMCasals, GFerrer, MCastro, JGavaldà, AMiralpeix, MRamos, IVilella, DHuerta, JMEspinosa, SHernández, BSegarra, VCórdoba, M Discovery of novel quaternary ammonium derivatives of (3R)-quinuclidinyl amides as potent and long acting muscarinic antagonists. Bioorg Med Chem Lett25:1736-41 (2015) 
 
Muscarinic acetylcholine receptor M2
Name:Muscarinic acetylcholine receptor M2
Type:GPCR
Mol. Mass.:51730.61
Organism:Homo sapiens (Human)
Description:P08172
Residue:466
BDBM50066858
NameBDBM50066858
Synonyms:CHEMBL3401650
TypeSmall organic molecule
Emp. Form.C25H29BrN2O3S2
Mol. Mass.549.543
SMILES[Br-].OC(C(=O)N[C@H]1C[N+]2(CCOc3ccccc3)CCC1CC2)(c1cccs1)c1cccs1