Reaction Details
TargetRho-associated protein kinase 2
LigandBDBM50431145
Substrate/Competitorn/a
Meas. Tech.ChEMBL_1466703 (CHEMBL3404496)
IC50 1.000000±n/a nM
Citation Mei, DYin, YWu, FCui, JZhou, HSun, GJiang, YFeng, Y Discovery of potent and selective urea-based ROCK inhibitors: Exploring the inhibitor's potency and ROCK2/PKA selectivity by 3D-QSAR, molecular docking and molecular dynamics simulations. Bioorg Med Chem23:2505-17 (2015) 
 
Rho-associated protein kinase 2
Name:Rho-associated protein kinase 2
Type:Protein
Mol. Mass.:160885.43
Organism:Homo sapiens (Human)
Description:O75116
Residue:1388
BDBM50431145
NameBDBM50431145
Synonyms:CHEMBL2332098
TypeSmall organic molecule
Emp. Form.C20H22N4O2
Mol. Mass.350.4143
SMILESCCN(Cc1cccc(OC)c1)C(=O)Nc1ccc(cc1)-c1cn[nH]c1