Reaction Details
TargetRho-associated protein kinase 2
LigandBDBM50069234
Substrate/Competitorn/a
Meas. Tech.ChEMBL_1466703 (CHEMBL3404496)
IC50<1.000000±n/a nM
Citation Mei, DYin, YWu, FCui, JZhou, HSun, GJiang, YFeng, Y Discovery of potent and selective urea-based ROCK inhibitors: Exploring the inhibitor's potency and ROCK2/PKA selectivity by 3D-QSAR, molecular docking and molecular dynamics simulations. Bioorg Med Chem23:2505-17 (2015) 
 
Rho-associated protein kinase 2
Name:Rho-associated protein kinase 2
Type:Protein
Mol. Mass.:160885.43
Organism:Homo sapiens (Human)
Description:O75116
Residue:1388
BDBM50069234
NameBDBM50069234
Synonyms:CHEMBL3402455
TypeSmall organic molecule
Emp. Form.C18H17FN4O2
Mol. Mass.340.3516
SMILESCOc1cccc(CNC(=O)Nc2ccc(cc2F)-c2cn[nH]c2)c1