Reaction Details
TargetRho-associated protein kinase 2
LigandBDBM50431134
Substrate/Competitorn/a
Meas. Tech.ChEMBL_1466703 (CHEMBL3404496)
IC50 1.000000±n/a nM
Citation Mei, DYin, YWu, FCui, JZhou, HSun, GJiang, YFeng, Y Discovery of potent and selective urea-based ROCK inhibitors: Exploring the inhibitor's potency and ROCK2/PKA selectivity by 3D-QSAR, molecular docking and molecular dynamics simulations. Bioorg Med Chem23:2505-17 (2015) 
 
Rho-associated protein kinase 2
Name:Rho-associated protein kinase 2
Type:Protein
Mol. Mass.:160885.43
Organism:Homo sapiens (Human)
Description:O75116
Residue:1388
BDBM50431134
NameBDBM50431134
Synonyms:CHEMBL2332068
TypeSmall organic molecule
Emp. Form.C22H27N5O2
Mol. Mass.393.4821
SMILESCOc1cccc(CN(CCN(C)C)C(=O)Nc2ccc(cc2)-c2cn[nH]c2)c1