Reaction Details
TargetMu-type opioid receptor
LigandBDBM50114010
Substrate/Competitorn/a
Meas. Tech.ChEMBL_1468973 (CHEMBL3412630)
Ki 10.0±n/a nM
Citation Hu, MGiulianotti, MAMcLaughlin, JPShao, JDebevec, GMaida, LEGeer, PCazares, MMisler, JLi, LDooley, CGanno, MLEans, SOMizrachi, ESantos, RGYongye, ABHoughten, RAYu, Y Synthesis and biological evaluations of novel endomorphin analogues containinga-hydroxy-ß-phenylalanine (AHPBA) displaying mixedµ/d opioid receptor agonist andd opioid receptor antagonist activities. Eur J Med Chem92:270-81 (2015) 
 
Mu-type opioid receptor
Name:Mu-type opioid receptor
Type:G Protein-Coupled Receptor (GPCR)
Mol. Mass.:44503.11
Organism:Rattus norvegicus (rat)
Description:Competition binding assays were carried out using membrane preparations from transfected HN9.10 cells that constitutively expressed the mu opioid receptor.
Residue:398
BDBM50114010
NameBDBM50114010
Synonyms:1-[2-Amino-3-(4-hydroxy-phenyl)-propionyl]-pyrrolidine-2-carboxylic acid [1-(1-benzyl-2-carbamoyl-ethylcarbamoyl)-2-(1H-indol-3-yl)-ethyl]-amide | CHEMBL430643
TypeSmall organic molecule
Emp. Form.C35H40N6O5
Mol. Mass.624.7293
SMILESN[C@@H](Cc1ccc(O)cc1)C(=O)N1CCC[C@H]1C(=O)N[C@@H](Cc1c[nH]c2ccccc12)C(=O)N[C@H](CC(N)=O)Cc1ccccc1