Reaction Details
TargetMu-type opioid receptor
LigandBDBM50071089
Substrate/Competitorn/a
Meas. Tech.ChEMBL_1468973 (CHEMBL3412630)
Ki 207±n/a nM
Citation Hu, MGiulianotti, MAMcLaughlin, JPShao, JDebevec, GMaida, LEGeer, PCazares, MMisler, JLi, LDooley, CGanno, MLEans, SOMizrachi, ESantos, RGYongye, ABHoughten, RAYu, Y Synthesis and biological evaluations of novel endomorphin analogues containinga-hydroxy-ß-phenylalanine (AHPBA) displaying mixedµ/d opioid receptor agonist andd opioid receptor antagonist activities. Eur J Med Chem92:270-81 (2015) 
 
Mu-type opioid receptor
Name:Mu-type opioid receptor
Type:G Protein-Coupled Receptor (GPCR)
Mol. Mass.:44503.11
Organism:Rattus norvegicus (rat)
Description:Competition binding assays were carried out using membrane preparations from transfected HN9.10 cells that constitutively expressed the mu opioid receptor.
Residue:398
BDBM50071089
NameBDBM50071089
Synonyms:CHEMBL3409754
TypeSmall organic molecule
Emp. Form.C33H38FN5O6
Mol. Mass.619.6831
SMILESN[C@@H](Cc1ccc(O)cc1)C(=O)N1CCC[C@H]1C(=O)N[C@@H](Cc1ccccc1)[C@@H](O)C(=O)NC(Cc1ccc(F)cc1)C(N)=O