Reaction Details
TargetDelta-type opioid receptor
LigandBDBM50071095
Substrate/Competitorn/a
Meas. Tech.ChEMBL_1468974 (CHEMBL3412631)
Ki 1.000000±n/a nM
Citation Hu, MGiulianotti, MAMcLaughlin, JPShao, JDebevec, GMaida, LEGeer, PCazares, MMisler, JLi, LDooley, CGanno, MLEans, SOMizrachi, ESantos, RGYongye, ABHoughten, RAYu, Y Synthesis and biological evaluations of novel endomorphin analogues containinga-hydroxy-ß-phenylalanine (AHPBA) displaying mixedµ/d opioid receptor agonist andd opioid receptor antagonist activities. Eur J Med Chem92:270-81 (2015) 
 
Delta-type opioid receptor
Name:Delta-type opioid receptor
Type:G Protein-Coupled Receptor (GPCR)
Mol. Mass.:40465.04
Organism:Rattus norvegicus (rat)
Description:Competition binding assays were using CHO-K1 cell membranes expressing the opioid receptor.
Residue:372
BDBM50071095
NameBDBM50071095
Synonyms:CHEMBL3409766
TypeSmall organic molecule
Emp. Form.C40H45N5O5
Mol. Mass.675.8158
SMILESCc1cc(O)cc(C)c1C[C@H](N)C(=O)N1CCc2ccccc2C1C(=O)N[C@H](CC(=O)N[C@@H](Cc1ccccc1)C(N)=O)Cc1ccccc1