Reaction Details
TargetDelta-type opioid receptor
LigandBDBM50071085
Substrate/Competitorn/a
Meas. Tech.ChEMBL_1468974 (CHEMBL3412631)
Ki 453±n/a nM
Citation Hu, MGiulianotti, MAMcLaughlin, JPShao, JDebevec, GMaida, LEGeer, PCazares, MMisler, JLi, LDooley, CGanno, MLEans, SOMizrachi, ESantos, RGYongye, ABHoughten, RAYu, Y Synthesis and biological evaluations of novel endomorphin analogues containinga-hydroxy-ß-phenylalanine (AHPBA) displaying mixedµ/d opioid receptor agonist andd opioid receptor antagonist activities. Eur J Med Chem92:270-81 (2015) 
 
Delta-type opioid receptor
Name:Delta-type opioid receptor
Type:G Protein-Coupled Receptor (GPCR)
Mol. Mass.:40465.04
Organism:Rattus norvegicus (rat)
Description:Competition binding assays were using CHO-K1 cell membranes expressing the opioid receptor.
Residue:372
BDBM50071085
NameBDBM50071085
Synonyms:CHEMBL3409740
TypeSmall organic molecule
Emp. Form.C35H40N6O6
Mol. Mass.640.7287
SMILESN[C@@H](Cc1ccc(O)cc1)C(=O)N1CCC[C@H]1C(=O)N[C@@H](Cc1c[nH]c2ccccc12)C(=O)N[C@@H](Cc1ccccc1)[C@@H](O)C(N)=O