Reaction Details
TargetKynurenine 3-monooxygenase
LigandBDBM50072077
Substrate/Competitorn/a
Meas. Tech.ChEMBL_1467950 (CHEMBL3413307)
IC50 3.2±n/a nM
Citation Toledo-Sherman, LMPrime, MEMrzljak, LBeconi, MGBeresford, ABrookfield, FABrown, CJCardaun, ICourtney, SMDijkman, UHamelin-Flegg, EJohnson, PDKempf, VLyons, KMatthews, KMitchell, WLO'Connell, CPena, PPowell, KRassoulpour, AReed, LReindl, WSelvaratnam, SFriley, WWWeddell, DAWent, NEWheelan, PWinkler, CWinkler, DWityak, JYarnold, CJYates, DMunoz-Sanjuan, IDominguez, C Development of a series of aryl pyrimidine kynurenine monooxygenase inhibitors as potential therapeutic agents for the treatment of Huntington's disease. J Med Chem58:1159-83 (2015) 
 
Kynurenine 3-monooxygenase
Name:Kynurenine 3-monooxygenase
Type:PROTEIN
Mol. Mass.:54371.88
Organism:Rattus norvegicus
Description:ChEMBL_1487468
Residue:478
BDBM50072077
NameBDBM50072077
Synonyms:CHEMBL3407866
TypeSmall organic molecule
Emp. Form.C11H6Cl2N2O2
Mol. Mass.269.084
SMILESOC(=O)c1cc(ncn1)-c1ccc(Cl)c(Cl)c1