Reaction Details
TargetAcetylcholinesterase
LigandBDBM50073113
Substrate/Competitorn/a
Meas. Tech.ChEMBL_1468482 (CHEMBL3412810)
IC50 92±n/a nM
Citation Xie, SSLan, JSWang, XBJiang, NDong, GLi, ZRWang, KDGuo, PPKong, LY Multifunctional tacrine-trolox hybrids for the treatment of Alzheimer's disease with cholinergic, antioxidant, neuroprotective and hepatoprotective properties. Eur J Med Chem93:42-50 (2015) 
 
Acetylcholinesterase
Name:Acetylcholinesterase
Type:Enzyme
Mol. Mass.:71812.79
Organism:Electrophorus electricus (Electric eel)
Description:n/a
Residue:633
BDBM50073113
NameBDBM50073113
Synonyms:CHEMBL3410955
TypeSmall organic molecule
Emp. Form.C34H45N3O3
Mol. Mass.543.7394
SMILESCc1c(C)c2OC(C)(CCc2c(C)c1O)C(=O)NCCCCCCCNc1c2CCCCc2nc2ccccc12