Reaction Details
TargetHistone deacetylase 1
LigandBDBM50078693
Substrate/Competitorn/a
Meas. Tech.ChEMBL_1471541 (CHEMBL3420276)
IC50>100000±n/a nM
Citation Lin, XChen, WQiu, ZGuo, LZhu, WLi, WWang, ZZhang, WZhang, ZRong, YZhang, MYu, LZhong, SZhao, RWu, XWong, JCTang, G Design and synthesis of orally bioavailable aminopyrrolidinone histone deacetylase 6 inhibitors. J Med Chem58:2809-20 (2015) 
 
Histone deacetylase 1
Name:Histone deacetylase 1
Type:Enzyme
Mol. Mass.:55090.27
Organism:Homo sapiens (Human)
Description:Q13547
Residue:482
BDBM50078693
NameBDBM50078693
Synonyms:CHEMBL3415626
TypeSmall organic molecule
Emp. Form.C18H19N3O3
Mol. Mass.325.3618
SMILESCC1(CCN(C1=O)c1ccccc1)Nc1ccc(cc1)C(=O)NO