Reaction Details
TargetHistone deacetylase 6
LigandBDBM50078693
Substrate/Competitorn/a
Meas. Tech.ChEMBL_1471542 (CHEMBL3420277)
IC50 460±n/a nM
Citation Lin, XChen, WQiu, ZGuo, LZhu, WLi, WWang, ZZhang, WZhang, ZRong, YZhang, MYu, LZhong, SZhao, RWu, XWong, JCTang, G Design and synthesis of orally bioavailable aminopyrrolidinone histone deacetylase 6 inhibitors. J Med Chem58:2809-20 (2015) 
 
Histone deacetylase 6
Name:Histone deacetylase 6
Type:Chromatin regulator; hydrolase; repressor
Mol. Mass.:131381.51
Organism:Homo sapiens (Human)
Description:Q9UBN7
Residue:1215
BDBM50078693
NameBDBM50078693
Synonyms:CHEMBL3415626
TypeSmall organic molecule
Emp. Form.C18H19N3O3
Mol. Mass.325.3618
SMILESCC1(CCN(C1=O)c1ccccc1)Nc1ccc(cc1)C(=O)NO