Reaction Details
TargetHistone deacetylase 6
LigandBDBM50078748
Substrate/Competitorn/a
Meas. Tech.ChEMBL_1471542 (CHEMBL3420277)
IC50 17±n/a nM
Citation Lin, XChen, WQiu, ZGuo, LZhu, WLi, WWang, ZZhang, WZhang, ZRong, YZhang, MYu, LZhong, SZhao, RWu, XWong, JCTang, G Design and synthesis of orally bioavailable aminopyrrolidinone histone deacetylase 6 inhibitors. J Med Chem58:2809-20 (2015) 
 
Histone deacetylase 6
Name:Histone deacetylase 6
Type:Chromatin regulator; hydrolase; repressor
Mol. Mass.:131381.51
Organism:Homo sapiens (Human)
Description:Q9UBN7
Residue:1215
BDBM50078748
NameBDBM50078748
Synonyms:CHEMBL3415629
TypeSmall organic molecule
Emp. Form.C18H18ClN3O3
Mol. Mass.359.807
SMILESC[C@@]1(CCN(C1=O)c1ccc(Cl)cc1)Nc1ccc(cc1)C(=O)NO