Reaction Details
TargetCytochrome P450 2C19
LigandBDBM50078748
Substrate/Competitorn/a
Meas. Tech.ChEMBL_1471628 (CHEMBL3420787)
IC50>50000±n/a nM
Citation Lin, XChen, WQiu, ZGuo, LZhu, WLi, WWang, ZZhang, WZhang, ZRong, YZhang, MYu, LZhong, SZhao, RWu, XWong, JCTang, G Design and synthesis of orally bioavailable aminopyrrolidinone histone deacetylase 6 inhibitors. J Med Chem58:2809-20 (2015) 
 
Cytochrome P450 2C19
Name:Cytochrome P450 2C19
Type:Enzyme
Mol. Mass.:55935.47
Organism:Homo sapiens (Human)
Description:P33261
Residue:490
BDBM50078748
NameBDBM50078748
Synonyms:CHEMBL3415629
TypeSmall organic molecule
Emp. Form.C18H18ClN3O3
Mol. Mass.359.807
SMILESC[C@@]1(CCN(C1=O)c1ccc(Cl)cc1)Nc1ccc(cc1)C(=O)NO